{"text_format":"1","workbook":"xlsx","n_sheets":9,"sheets":["Menu","Cad","PE","AC","RC","GR","RI","Instruções","GR_Dados"],"not_rendered":{"charts":6,"images":22,"macros":1,"external_links":0,"defined_names":3,"comments":2,"pivot_tables":0},"unopened":[],"bounds":{"document_bytes":16777216,"sheet_cells":100000,"rows_first":2000,"rows_last":500,"rows_between":2000,"halvings":0,"cell_chars":16384,"cell_head_chars":4096},"cells_cut":0,"cells_raw":0,"read":"whole","date_system":"1900"}

{"sheet":"Menu","index":0,"n_rows":26,"n_cols":7,"rows_kept":26,"cut":false,"hidden":false,"merged":[[25,4,25,5],[25,6,25,14]]}
[]
[]
[]
[]
[]
[]
[]
[]
[]
[]
[]
[]
[]
[]
[]
[]
[]
[]
[]
[]
{"$rows_left_out":7}
{"sheet":"Cad","index":1,"n_rows":511,"n_cols":24,"rows_kept":511,"cut":false,"hidden":false,"merged":[]}
[]
[]
[]
[]
[]
[]
[]
[]
[]
[]
[null,"Produto","Preço de Venda","Projeções de vendas mensais","Receita bruta mensal","% de Participação","Matéria - Prima","Comissões (%)","Impostos (%)","Outros gastos","Total custo por produto",null,"Custo Fixo","Valor (R$)",null,null,"Comissões (%)","Impostos (%)","Margem de contribuição unitária","IMC (%)","Receita no ponto de equilíbrio","Quantidade a ser vendida","Outros Gastos","Matéria Prima"]
[null,"Camisa",100,50,{"$f":"IFERROR(IF(B12=\"\",\"\",C12*D12),\"\")","v":5000},{"$f":"IFERROR(E12/SUM($E$12:$E$511),\"\")","v":0.19762845849802371},15,0.03,0.12,10,{"$f":"G12+C12*(H12+I12)+J12","v":40},null,"Pró Labore e salários",6500,null,null,{"$f":"IFERROR(H12*E12,\"\")","v":150},{"$f":"IFERROR(I12*E12,\"\")","v":600},{"$f":"IFERROR(C12-K12,\"\")","v":60},{"$f":"IFERROR(S12/C12,\"\")","v":0.6},{"$f":"IFERROR(V12*C12,\"\")","v":7870.7681732256406},{"$f":"IFERROR(F12*PE!$F$20,\"\")","v":78.707681732256404},{"$f":"IFERROR(J12*D12,\"\")","v":500},{"$f":"IFERROR(G12*D12,\"\")","v":750}]
[null,"Calça",120,40,{"$f":"IFERROR(IF(B13=\"\",\"\",C13*D13),\"\")","v":4800},{"$f":"IFERROR(E13/SUM($E$12:$E$511),\"\")","v":0.18972332015810275},28,0.03,0.12,18,{"$f":"G13+C13*(H13+I13)+J13","v":64},null,"Taxa de propriedade (águal e luz)",600,null,null,{"$f":"IFERROR(H13*E13,\"\")","v":144},{"$f":"IFERROR(I13*E13,\"\")","v":576},{"$f":"IFERROR(C13-K13,\"\")","v":56},{"$f":"IFERROR(S13/C13,\"\")","v":0.46666666666666667},{"$f":"IFERROR(V13*C13,\"\")","v":9067.1249355559376},{"$f":"IFERROR(F13*PE!$F$20,\"\")","v":75.559374462966147},{"$f":"IFERROR(J13*D13,\"\")","v":720},{"$f":"IFERROR(G13*D13,\"\")","v":1120}]
[null,"Camiseta",70,200,14000,0.55335968379446643,8,0.03,0.12,6,24.5,null,"Telefone e internet",700,null,null,420,1680,45.5,0.65,15426.705619522258,{"$f":"IFERROR(F14*PE!$F$20,\"\")","v":220.38150885031797},1200,1600]
[null,"Pijamas",50,30,1500,5.9288537549407112E-2,20,0.03,0.12,5,32.5,null,"Aluguel",2000,null,null,45,180,17.5,0.35,1180.6152259838461,{"$f":"IFERROR(F15*PE!$F$20,\"\")","v":23.612304519676922},150,600]
[null,null,null,null,"","",null,null,null,null,0,null,"Marketing",2000,null,null,"","",0,"","",{"$f":"IFERROR(F16*PE!$F$20,\"\")","v":""},0,0]
[null,null,null,null,"","",null,null,null,null,0,null,"Empréstimos",1350,null,null,"","",0,"","",{"$f":"IFERROR(F17*PE!$F$20,\"\")","v":""},0,0]
[null,null,null,null,"","",null,null,null,null,0,null,"Legais e Jurídicos",980,null,null,"","",0,"","",{"$f":"IFERROR(F18*PE!$F$20,\"\")","v":""},0,0]
[null,null,null,null,"","",null,null,null,null,0,null,"Outros Custos",1900,null,null,"","",0,"","",{"$f":"IFERROR(F19*PE!$F$20,\"\")","v":""},0,0]
[null,null,null,null,"","",null,null,null,null,0,null,null,null,null,null,"","",0,"","",{"$f":"IFERROR(F20*PE!$F$20,\"\")","v":""},0,0]
{"$rows_left_out":492}
{"sheet":"PE","index":2,"n_rows":21,"n_cols":9,"rows_kept":21,"cut":false,"hidden":false,"merged":[[17,1,19,1],[20,1,22,1],[17,2,19,2],[20,2,22,2],[11,4,14,4],[15,4,18,4],[19,4,22,4],[11,1,13,1],[11,2,13,2],[14,1,16,1],[14,2,16,2],[19,5,22,5],[11,7,12,7],[13,7,14,7],[15,7,16,7],[17,7,18,7],[19,7,20,7],[11,5,14,5],[15,5,18,5],[11,8,12,8],[13,8,14,8],[15,8,16,8],[17,8,18,8],[19,8,20,8]]}
[]
[]
[]
[]
[]
[]
[]
[]
[]
[]
[null,"Descrição","Valor (R$)",null,"Descrição","Valor (R$)",null,"Selecione o seu produto:","Calça"]
[null,"Preço de venda médio dos seus produtos",{"$f":"IFERROR(AVERAGEIF(Cad!C12:C511,\">0\"),\"\")","v":85},null,"Qual o valor total dos seus custos fixos?",{"$f":"SUM(Cad!N12:N51)","v":16030},null,{"$f":"\"Receita do(a) \"&I11&\" no Ponto de Equilíbrio\"","v":"Receita do(a) Calça no Ponto de Equilíbrio"},{"$f":"IFERROR(VLOOKUP(I11,Cad!$B$12:$X$511,20,0),\"\")","v":9067.1249355559376}]
[]
[null,null,null,null,null,null,null,"Unidades",{"$f":"IFERROR(VLOOKUP(I11,Cad!$B$12:$X$511,21,0),\"\")","v":75.559374462966147}]
[null,"Margem de contribuição média dos seus produtos",{"$f":"IFERROR(AVERAGEIF(Cad!K12:K511,\">0\"),\"\")","v":40.25}]
[null,null,null,null,"Qual deve ser o faturamento para não ter prejuízo?",{"$f":"IFERROR(F12/(C15/C12),\"\")","v":33852.17391304348},null,"Total de despesas diretas",{"$f":"IFERROR(VLOOKUP(I11,Cad!$B$12:$X$511,10,0)*I14,\"\")","v":4835.7999656298334}]
[]
[null,"Custos diretos totais",{"$f":"SUM(Cad!K12:K511)","v":161},null,null,null,null,"MC unitária",{"$f":"IFERROR(VLOOKUP(I11,Cad!$B$12:$X$511,18,0),\"\")","v":56}]
[]
[null,null,null,null,"Quantos produtos você precisa vender para não ter prejuízo?",{"$f":"IFERROR(F16/C12,\"\")","v":398.26086956521743},null,"MC ponderada",{"$f":"IFERROR(VLOOKUP(I11,Cad!$B$12:$X$511,5,0)*I18,\"\")","v":10.624505928853754}]
{"$rows_left_out":2}
{"sheet":"AC","index":3,"n_rows":60,"n_cols":9,"rows_kept":60,"cut":false,"hidden":false,"merged":[]}
[]
[]
[]
[]
[]
[]
[]
[]
[]
[null,"Empresa","Diferencial","Produto","Preço Concorrente","Seu Preço","Diferença","Orientação"]
[null,"Camisaria XYZ Ltda","Preço","Camisa",110,{"$f":"IFERROR(IF(D11=\"\",\"\",VLOOKUP(D11,Cad!$B$12:$C$511,2,0)),\"\")","v":100},{"$f":"IF(F11=\"\",\"\",F11-E11)","v":-10},{"$f":"IFERROR(IF(G11<0,\"Seu preço está  \"&-I11*100&\" % mais barato. Vale aumentar?\",IF(G11>0,\"Seu preço está \"&I11*100&\"% mais caro. Diminuir preço?\",\"Seu preço está igual ao de mercado. Manter o preço?\")),\"\")","v":"Seu preço está  9 % mais barato. Vale aumentar?"},{"$f":"IFERROR(ROUND(F11/E11-1,2),\"\")","v":-0.09}]
[null,"Malharia XYZ Ltda","Qualidade","Malha",110,{"$f":"IFERROR(IF(D12=\"\",\"\",VLOOKUP(D12,Cad!$B$12:$C$511,2,0)),\"\")","v":""},{"$f":"IF(F12=\"\",\"\",F12-E12)","v":""},{"$f":"IFERROR(IF(G12<0,\"Seu preço está  \"&-I12*100&\" % mais barato. Vale aumentar?\",IF(G12>0,\"Seu preço está \"&I12*100&\"% mais caro. Diminuir preço?\",\"Seu preço está igual ao de mercado. Manter o preço?\")),\"\")","v":""},{"$f":"IFERROR(ROUND(F12/E12-1,2),\"\")","v":""}]
[null,"Empresa de roupas Ltda","Localização Geográfica","Calça",150,{"$f":"IFERROR(IF(D13=\"\",\"\",VLOOKUP(D13,Cad!$B$12:$C$511,2,0)),\"\")","v":120},-30,"Seu preço está  20 % mais barato. Vale aumentar?",-0.2]
[null,"Roupas femininas Ltda","Preço","Saia",98,{"$f":"IFERROR(IF(D14=\"\",\"\",VLOOKUP(D14,Cad!$B$12:$C$511,2,0)),\"\")","v":""},"","",""]
[null,"Moda Jeans Ltda","Localização Geográfica","Jeans",140,{"$f":"IFERROR(IF(D15=\"\",\"\",VLOOKUP(D15,Cad!$B$12:$C$511,2,0)),\"\")","v":""},"","",""]
[null,"Camisaria Colombo","Preço","Cueca",16,{"$f":"IFERROR(IF(D16=\"\",\"\",VLOOKUP(D16,Cad!$B$12:$C$511,2,0)),\"\")","v":""},"","",""]
[null,null,null,null,null,{"$f":"IFERROR(IF(D17=\"\",\"\",VLOOKUP(D17,Cad!$B$12:$C$511,2,0)),\"\")","v":""},"","",{"$f":"IFERROR(ROUND(F17/E17-1,2),\"\")","v":""}]
[null,null,null,null,null,{"$f":"IFERROR(IF(D18=\"\",\"\",VLOOKUP(D18,Cad!$B$12:$C$511,2,0)),\"\")","v":""},"","",{"$f":"IFERROR(ROUND(F18/E18-1,2),\"\")","v":""}]
[null,null,null,null,null,{"$f":"IFERROR(IF(D19=\"\",\"\",VLOOKUP(D19,Cad!$B$12:$C$511,2,0)),\"\")","v":""},"","",""]
[null,null,null,null,null,{"$f":"IFERROR(IF(D20=\"\",\"\",VLOOKUP(D20,Cad!$B$12:$C$511,2,0)),\"\")","v":""},"","",""]
{"$rows_left_out":41}
{"sheet":"RC","index":4,"n_rows":37,"n_cols":9,"rows_kept":37,"cut":false,"hidden":false,"merged":[[34,1,34,2],[35,1,35,2],[36,1,36,2],[28,1,28,2],[29,1,29,2],[30,1,30,2],[31,1,31,2],[32,1,32,2],[33,1,33,2],[27,1,27,2],[15,6,15,7],[15,8,15,9],[17,1,17,7],[18,5,18,7],[19,5,19,7],[20,5,20,7],[21,5,21,7],[22,5,22,7],[23,5,23,7],[25,1,25,4],[26,1,26,2],[12,6,12,7],[12,8,12,9],[13,6,13,7],[13,8,13,9],[14,6,14,7],[14,8,14,9],[12,3,12,4],[13,1,13,2],[13,3,13,4],[14,1,14,2],[14,3,14,4],[12,1,12,2],[9,6,9,9],[10,6,10,7],[10,8,10,9],[11,6,11,7],[11,8,11,9],[9,1,9,4],[10,1,10,2],[10,3,10,4],[11,1,11,2],[11,3,11,4]]}
[]
[]
[]
[]
[]
[]
[]
[]
[]
[null,"Resumo dos Custos Diretos",null,null,null,null,"Top 5 Custos Fixos"]
[null,"Matéria - prima",null,{"$f":"IFERROR(SUM(Cad!G12:G511),\"\")","v":71},null,null,{"$f":"IFERROR(IF(I11=I10,INDEX(OFFSET(Cad!$M$12:$M$51,MATCH(I10,Cad!$N$12:$N$51,0),0),MATCH(I11,OFFSET(Cad!$N$12:$N$51,MATCH(I11,Cad!$N$12:$N$51,0),0),0),1),INDEX(Cad!$M$12:$M$51,MATCH(I11,Cad!$N$12:$N$51,0),1)),\"\"\n)","v":"Pró Labore e salários"},null,{"$f":"IFERROR(LARGE(Cad!N12:N51,1),\"\")","v":6500}]
[null,"Impostos",null,{"$f":"IFERROR(SUM(Cad!I12:I511),\"\")","v":0.48},null,null,{"$f":"IFERROR(IF(I12=I11,INDEX(OFFSET(Cad!$M$12:$M$51,MATCH(I11,Cad!$N$12:$N$51,0),0),MATCH(I12,OFFSET(Cad!$N$12:$N$51,MATCH(I12,Cad!$N$12:$N$51,0),0),0),1),INDEX(Cad!$M$12:$M$51,MATCH(I12,Cad!$N$12:$N$51,0),1)),\"\"\n)","v":"Aluguel"},null,{"$f":"IFERROR(LARGE(Cad!N12:N51,2),\"\")","v":2000}]
[null,"Comissões",null,{"$f":"IFERROR(SUM(Cad!H12:H511),\"\")","v":0.12},null,null,{"$f":"IFERROR(IF(I13=I12,INDEX(OFFSET(Cad!$M$12:$M$51,MATCH(I12,Cad!$N$12:$N$51,0),0),MATCH(I13,OFFSET(Cad!$N$12:$N$51,MATCH(I13,Cad!$N$12:$N$51,0),0),0),1),INDEX(Cad!$M$12:$M$51,MATCH(I13,Cad!$N$12:$N$51,0),1)),\"\"\n)","v":"Marketing"},null,{"$f":"IFERROR(LARGE(Cad!N12:N51,3),\"\")","v":2000}]
[null,"Outros gastos",null,{"$f":"IFERROR(SUM(Cad!J12:J511),\"\")","v":39},null,null,{"$f":"IFERROR(IF(I14=I13,INDEX(OFFSET(Cad!$M$12:$M$51,MATCH(I13,Cad!$N$12:$N$51,0),0),MATCH(I14,OFFSET(Cad!$N$12:$N$51,MATCH(I14,Cad!$N$12:$N$51,0),0),0),1),INDEX(Cad!$M$12:$M$51,MATCH(I14,Cad!$N$12:$N$51,0),1)),\"\"\n)","v":"Outros Custos"},null,{"$f":"IFERROR(LARGE(Cad!N12:N51,4),\"\")","v":1900}]
[null,"Total dos gastos",null,{"$f":"SUM(D11:E14)","v":110.60000000000001},null,null,{"$f":"IFERROR(IF(I15=I14,INDEX(OFFSET(Cad!$M$12:$M$51,MATCH(I14,Cad!$N$12:$N$51,0),0),MATCH(I15,OFFSET(Cad!$N$12:$N$51,MATCH(I15,Cad!$N$12:$N$51,0),0),0),1),INDEX(Cad!$M$12:$M$51,MATCH(I15,Cad!$N$12:$N$51,0),1)),\"\"\n)","v":"Empréstimos"},null,{"$f":"IFERROR(LARGE(Cad!N12:N51,5),\"\")","v":1350}]
[null,null,null,null,null,null,"Total dos custos fixos",null,{"$f":"SUM(Cad!N12:N51)","v":16030}]
[]
[null,"Análise da concorrência (máximo de 5 produtos comparados)"]
[null,"Produtos","Preço médio de mercado","Preço praticado por você","Diferença","Comentário"]
[null,{"$f":"IFERROR(IF(D20=\"\",\"\",IF(D20=D19,INDEX(OFFSET(AC!$D$11:$D$50,MATCH(D20,AC!$F$11:$F$50,0),0),MATCH(D20,OFFSET(AC!$F$11:$F$50,MATCH(D20,AC!$F$11:$F$50,0),0),0),1),INDEX(AC!$D$11:$D$50,MATCH(D20,AC!$F$11:$F$50,0),1))),\"\")","v":"Calça"},{"$f":"IFERROR(VLOOKUP(B20,AC!$D$11:$E$50,2,0),\"\")","v":150},{"$f":"IFERROR(LARGE(AC!$F$11:$F$50,1),\"\")","v":120},{"$f":"IF(ISERROR(\nIF(B20=\"\",\"\",D20-C20)),\"\",IF(B20=\"\",\"\",D20-C20))","v":-30},{"$f":"IF(ISERROR(\nIF(E20<0,\"Seu preço está  \"&-I20*100&\" % mais barato. Vale aumentar?\",IF(E20>0,\"Seu preço está \"&I20*100&\"% mais caro. Diminuir preço?\",\"Seu preço está igual ao de mercado. Manter o preço?\"))),\"\",IF(E20<0,\"Seu preço está  \"&-I20*100&\" % mais barato. Vale aumentar?\",IF(E20>0,\"Seu preço está \"&I20*100&\"% mais caro. Diminuir preço?\",\"Seu preço está igual ao de mercado. Manter o preço?\")))","v":"Seu preço está  20 % mais barato. Vale aumentar?"},null,null,{"$f":"IFERROR(ROUND(D20/C20-1,2),\"\")","v":-0.2}]
{"$rows_left_out":18}
{"sheet":"GR","index":5,"n_rows":90,"n_cols":17,"rows_kept":90,"cut":false,"hidden":false,"merged":[[12,6,18,7],[56,6,63,7],[73,6,80,7],[89,6,98,7],[41,6,48,7],[26,6,32,7]]}
[]
[]
[]
[]
[]
[]
[]
[]
[]
[null,"Top 10 Mix de Produtos - Receita Gerada necessária para \"Ponto de Equilíbrio\""]
[]
[]
[null,null,null,null,null,null,{"$f":"\"O produto que mais gerou receita para atingir o ponto de equilíbrio foi: \"&\"\n\"&'RC'!B28","v":"O produto que mais gerou receita para atingir o ponto de equilíbrio foi: \nCamiseta"}]
[]
[]
[]
[]
[]
[]
[]
{"$rows_left_out":71}
{"sheet":"RI","index":6,"n_rows":62,"n_cols":8,"rows_kept":62,"cut":false,"hidden":false,"merged":[[10,7,10,8],[10,2,10,5]]}
[]
[]
[]
[]
[]
[]
[]
[]
[]
[]
[null,"Empresa:",{"$f":"Menu!G26","v":"Sebrae"},null,null,null,null,{"$f":"CONCATENATE(\"data da impressão: \",TEXT(TODAY(),\"DD/MM/AAAA\"))","v":"data da impressão: 31/03/2023"}]
[]
[null,"1. Margem de Contribuição"]
[]
[]
[]
[]
[]
[]
[]
{"$rows_left_out":43}
{"sheet":"Instruções","index":7,"n_rows":146,"n_cols":2,"rows_kept":146,"cut":false,"hidden":false,"merged":[]}
[]
[]
[]
[]
[]
[]
[]
[]
[]
[]
[null,"1. Cadastros Gerais"]
[]
[]
[]
[]
[]
[]
[]
[]
[]
{"$rows_left_out":127}
{"sheet":"GR_Dados","index":8,"n_rows":52,"n_cols":5,"rows_kept":52,"cut":false,"hidden":false,"merged":[[44,0,44,1],[45,0,45,1],[46,0,46,1],[51,0,51,1],[35,0,35,1],[36,0,36,1],[37,0,37,1],[38,0,38,1],[42,0,42,1],[43,0,43,1],[34,0,34,1],[20,0,20,1],[21,0,21,1],[22,0,22,1],[23,0,23,1],[24,0,24,1],[28,0,28,1],[29,0,29,1],[30,0,30,1],[31,0,31,1],[32,0,32,1],[33,0,33,1],[19,0,19,1],[6,0,6,1],[7,0,7,1],[8,0,8,1],[9,0,9,1],[10,0,10,1],[11,0,11,1],[14,0,14,1],[15,0,15,1],[16,0,16,1],[17,0,17,1],[18,0,18,1],[1,0,1,1],[2,0,2,1],[3,0,3,1],[4,0,4,1],[5,0,5,1]]}
["Top 10 Mix de Produtos - quantidade"]
["Produtos",null,"Quantidade a ser vendida"]
[{"$f":"IFERROR(IF(C3=\"\",\"\",IF(C3=C2,INDEX(OFFSET(Cad!$B$12:$B$511,MATCH(C3,Cad!$V$12:$V$511,0),0),MATCH(C3,OFFSET(Cad!$V$12:$V$511,MATCH(C3,Cad!$V$12:$V$511,0),0),0),1),INDEX(Cad!$B$12:$B$511,MATCH(C3,Cad!$V$12:$V$511,0),1))),\"\")","v":"Camiseta"},null,{"$f":"IFERROR(IF(LARGE(Cad!$V$12:$V$511,D3)=0,\"\",LARGE(Cad!$V$12:$V$511,D3)),\"\")","v":220.38150885031797},1,{"$f":"IF(C3=\"\",\"\",ROUND(C3,0))","v":220}]
[{"$f":"IFERROR(IF(C4=\"\",\"\",IF(C4=C3,INDEX(OFFSET(Cad!$B$12:$B$511,MATCH(C4,Cad!$V$12:$V$511,0),0),MATCH(C4,OFFSET(Cad!$V$12:$V$511,MATCH(C4,Cad!$V$12:$V$511,0),0),0),1),INDEX(Cad!$B$12:$B$511,MATCH(C4,Cad!$V$12:$V$511,0),1))),\"\")","v":"Camisa"},null,{"$f":"IFERROR(IF(LARGE(Cad!$V$12:$V$511,D4)=0,\"\",LARGE(Cad!$V$12:$V$511,D4)),\"\")","v":78.707681732256404},2,{"$f":"IF(C4=\"\",\"\",ROUND(C4,0))","v":79}]
[{"$f":"IFERROR(IF(C5=\"\",\"\",IF(C5=C4,INDEX(OFFSET(Cad!$B$12:$B$511,MATCH(C5,Cad!$V$12:$V$511,0),0),MATCH(C5,OFFSET(Cad!$V$12:$V$511,MATCH(C5,Cad!$V$12:$V$511,0),0),0),1),INDEX(Cad!$B$12:$B$511,MATCH(C5,Cad!$V$12:$V$511,0),1))),\"\")","v":"Calça"},null,{"$f":"IFERROR(IF(LARGE(Cad!$V$12:$V$511,D5)=0,\"\",LARGE(Cad!$V$12:$V$511,D5)),\"\")","v":75.559374462966147},3,76]
[{"$f":"IFERROR(IF(C6=\"\",\"\",IF(C6=C5,INDEX(OFFSET(Cad!$B$12:$B$511,MATCH(C6,Cad!$V$12:$V$511,0),0),MATCH(C6,OFFSET(Cad!$V$12:$V$511,MATCH(C6,Cad!$V$12:$V$511,0),0),0),1),INDEX(Cad!$B$12:$B$511,MATCH(C6,Cad!$V$12:$V$511,0),1))),\"\")","v":"Pijamas"},null,{"$f":"IFERROR(IF(LARGE(Cad!$V$12:$V$511,D6)=0,\"\",LARGE(Cad!$V$12:$V$511,D6)),\"\")","v":23.612304519676922},4,24]
[{"$f":"IFERROR(IF(C7=\"\",\"\",IF(C7=C6,INDEX(OFFSET(Cad!$B$12:$B$511,MATCH(C7,Cad!$V$12:$V$511,0),0),MATCH(C7,OFFSET(Cad!$V$12:$V$511,MATCH(C7,Cad!$V$12:$V$511,0),0),0),1),INDEX(Cad!$B$12:$B$511,MATCH(C7,Cad!$V$12:$V$511,0),1))),\"\")","v":""},null,{"$f":"IFERROR(IF(LARGE(Cad!$V$12:$V$511,D7)=0,\"\",LARGE(Cad!$V$12:$V$511,D7)),\"\")","v":""},5,""]
[{"$f":"IFERROR(IF(C8=\"\",\"\",IF(C8=C7,INDEX(OFFSET(Cad!$B$12:$B$511,MATCH(C8,Cad!$V$12:$V$511,0),0),MATCH(C8,OFFSET(Cad!$V$12:$V$511,MATCH(C8,Cad!$V$12:$V$511,0),0),0),1),INDEX(Cad!$B$12:$B$511,MATCH(C8,Cad!$V$12:$V$511,0),1))),\"\")","v":""},null,{"$f":"IFERROR(IF(LARGE(Cad!$V$12:$V$511,D8)=0,\"\",LARGE(Cad!$V$12:$V$511,D8)),\"\")","v":""},6,""]
[{"$f":"IFERROR(IF(C9=\"\",\"\",IF(C9=C8,INDEX(OFFSET(Cad!$B$12:$B$511,MATCH(C9,Cad!$V$12:$V$511,0),0),MATCH(C9,OFFSET(Cad!$V$12:$V$511,MATCH(C9,Cad!$V$12:$V$511,0),0),0),1),INDEX(Cad!$B$12:$B$511,MATCH(C9,Cad!$V$12:$V$511,0),1))),\"\")","v":""},null,{"$f":"IFERROR(IF(LARGE(Cad!$V$12:$V$511,D9)=0,\"\",LARGE(Cad!$V$12:$V$511,D9)),\"\")","v":""},7,""]
[{"$f":"IFERROR(IF(C10=\"\",\"\",IF(C10=C9,INDEX(OFFSET(Cad!$B$12:$B$511,MATCH(C10,Cad!$V$12:$V$511,0),0),MATCH(C10,OFFSET(Cad!$V$12:$V$511,MATCH(C10,Cad!$V$12:$V$511,0),0),0),1),INDEX(Cad!$B$12:$B$511,MATCH(C10,Cad!$V$12:$V$511,0),1))),\"\")","v":""},null,{"$f":"IFERROR(IF(LARGE(Cad!$V$12:$V$511,D10)=0,\"\",LARGE(Cad!$V$12:$V$511,D10)),\"\")","v":""},8,""]
[{"$f":"IFERROR(IF(C11=\"\",\"\",IF(C11=C10,INDEX(OFFSET(Cad!$B$12:$B$511,MATCH(C11,Cad!$V$12:$V$511,0),0),MATCH(C11,OFFSET(Cad!$V$12:$V$511,MATCH(C11,Cad!$V$12:$V$511,0),0),0),1),INDEX(Cad!$B$12:$B$511,MATCH(C11,Cad!$V$12:$V$511,0),1))),\"\")","v":""},null,{"$f":"IFERROR(IF(LARGE(Cad!$V$12:$V$511,D11)=0,\"\",LARGE(Cad!$V$12:$V$511,D11)),\"\")","v":""},9,""]
[{"$f":"IFERROR(IF(C12=\"\",\"\",IF(C12=C11,INDEX(OFFSET(Cad!$B$12:$B$511,MATCH(C12,Cad!$V$12:$V$511,0),0),MATCH(C12,OFFSET(Cad!$V$12:$V$511,MATCH(C12,Cad!$V$12:$V$511,0),0),0),1),INDEX(Cad!$B$12:$B$511,MATCH(C12,Cad!$V$12:$V$511,0),1))),\"\")","v":""},null,{"$f":"IFERROR(IF(LARGE(Cad!$V$12:$V$511,D12)=0,\"\",LARGE(Cad!$V$12:$V$511,D12)),\"\")","v":""},10,""]
[]
[]
["Produtos",null,"Margem de Contribuição"]
[{"$f":"IFERROR(IF(C16=\"\",\"\",IF(C16=C15,INDEX(OFFSET(Cad!$B$12:$B$511,MATCH(C16,Cad!$T$12:$T$511,0),0),MATCH(C16,OFFSET(Cad!$T$12:$T$511,MATCH(C16,Cad!$T$12:$T$511,0),0),0),1),INDEX(Cad!$B$12:$B$511,MATCH(C16,Cad!$T$12:$T$511,0),1))),\"\")","v":"Camiseta"},null,{"$f":"IFERROR(IF(LARGE(Cad!$T$12:$T$511,D16)=0,\"\",LARGE(Cad!$T$12:$T$511,D16)),\"\")","v":0.65},1]
[{"$f":"IFERROR(IF(C17=\"\",\"\",IF(C17=C16,INDEX(OFFSET(Cad!$B$12:$B$511,MATCH(C17,Cad!$T$12:$T$511,0),0),MATCH(C17,OFFSET(Cad!$T$12:$T$511,MATCH(C17,Cad!$T$12:$T$511,0),0),0),1),INDEX(Cad!$B$12:$B$511,MATCH(C17,Cad!$T$12:$T$511,0),1))),\"\")","v":"Camisa"},null,{"$f":"IFERROR(IF(LARGE(Cad!$T$12:$T$511,D17)=0,\"\",LARGE(Cad!$T$12:$T$511,D17)),\"\")","v":0.6},2]
[{"$f":"IFERROR(IF(C18=\"\",\"\",IF(C18=C17,INDEX(OFFSET(Cad!$B$12:$B$511,MATCH(C18,Cad!$T$12:$T$511,0),0),MATCH(C18,OFFSET(Cad!$T$12:$T$511,MATCH(C18,Cad!$T$12:$T$511,0),0),0),1),INDEX(Cad!$B$12:$B$511,MATCH(C18,Cad!$T$12:$T$511,0),1))),\"\")","v":"Calça"},null,{"$f":"IFERROR(IF(LARGE(Cad!$T$12:$T$511,D18)=0,\"\",LARGE(Cad!$T$12:$T$511,D18)),\"\")","v":0.46666666666666667},3]
[{"$f":"IFERROR(IF(C19=\"\",\"\",IF(C19=C18,INDEX(OFFSET(Cad!$B$12:$B$511,MATCH(C19,Cad!$T$12:$T$511,0),0),MATCH(C19,OFFSET(Cad!$T$12:$T$511,MATCH(C19,Cad!$T$12:$T$511,0),0),0),1),INDEX(Cad!$B$12:$B$511,MATCH(C19,Cad!$T$12:$T$511,0),1))),\"\")","v":"Pijamas"},null,{"$f":"IFERROR(IF(LARGE(Cad!$T$12:$T$511,D19)=0,\"\",LARGE(Cad!$T$12:$T$511,D19)),\"\")","v":0.35},4]
[{"$f":"IFERROR(IF(C20=\"\",\"\",IF(C20=C19,INDEX(OFFSET(Cad!$B$12:$B$511,MATCH(C20,Cad!$T$12:$T$511,0),0),MATCH(C20,OFFSET(Cad!$T$12:$T$511,MATCH(C20,Cad!$T$12:$T$511,0),0),0),1),INDEX(Cad!$B$12:$B$511,MATCH(C20,Cad!$T$12:$T$511,0),1))),\"\")","v":""},null,{"$f":"IFERROR(IF(LARGE(Cad!$T$12:$T$511,D20)=0,\"\",LARGE(Cad!$T$12:$T$511,D20)),\"\")","v":""},5]
{"$rows_left_out":32}